Reaction Details
TargetProtein-tyrosine kinase 2-beta
LigandBDBM286384
Substrate/Competitorn/a
Meas. Tech.Inhibition Assay
pH7.4±n/a
Ki<10.00±n/a nM
Commentsextracted
Citation Li, HNukui, SScales, SATeng, MYin, C Substituted pyrrolo[3,4-c]pyrazoles as PKC kinase inhibitors US Patent US9518060 Publication Date 12/13/2016
 
Protein-tyrosine kinase 2-beta
Name:Protein-tyrosine kinase 2-beta
Type:Protein
Mol. Mass.:115868.80
Organism:Homo sapiens (Human)
Description:Q14289
Residue:1009
BDBM286384
NameBDBM286384
Synonyms:5-{[(2S,5R)-2,5-dimethyl-4-(tetrahydro-2H-pyran-4-ylmethyl)piperazin-1-yl]carbonyl}-N-[5-fluoro-2-(methoxymethyl)pyrimidin-4-yl]-6,6-dimethyl-1,4,5,6-tetrahydropyrrolo[3,4-c]pyrazol-3-amine | US9518060, Example N1
TypeSmall organic molecule
Emp. Form.C27H40FN7O3
Mol. Mass.529.65
SMILESCOCc1ncc(F)c(Nc2n[nH]c3c2CN(C(=O)C2C[C@@H](C)N(CC4CCOCC4)C[C@@H]2C)C3(C)C)n1