Reaction Details
TargetProtein-tyrosine kinase 2-beta
LigandBDBM286385
Substrate/Competitorn/a
Meas. Tech.Inhibition Assay
pH7.4±n/a
Ki<10.00±n/a nM
Commentsextracted
Citation Li, HNukui, SScales, SATeng, MYin, C Substituted pyrrolo[3,4-c]pyrazoles as PKC kinase inhibitors US Patent US9518060 Publication Date 12/13/2016
 
Protein-tyrosine kinase 2-beta
Name:Protein-tyrosine kinase 2-beta
Type:Protein
Mol. Mass.:115868.80
Organism:Homo sapiens (Human)
Description:Q14289
Residue:1009
BDBM286385
NameBDBM286385
Synonyms:US11220518, Ex. No. N3 US9518060, Example N2 | US9518060, Example N3
TypeSmall organic molecule
Emp. Form.C22H33FN8O3
Mol. Mass.476.5476
SMILESCOCc1ncc(F)c(Nc2n[nH]c3c2CN(C(=O)N2CC(CCO)N(C)C[C@@H]2C)C3(C)C)n1