Reaction Details
TargetEndothelial lipase
LigandBDBM151315
Substrate/Competitorn/a
Meas. Tech.Biological Assay
pH8±n/a
Temperature298.15±n/a K
IC50 0.7±n/a nM
Commentsextracted
Citation Finlay, HJiang, JKim, SParkhurst, BQiao, JXWang, TCPi, ZTora, GOLloyd, JJohnson, JA Amide, urea or sulfone amide linked benzothiazole inhibitors of endothelial lipase US Patent US8987314 Publication Date 3/24/2015
 
Endothelial lipase
Name:Endothelial lipase
Type:Protein
Mol. Mass.:56805.62
Organism:Homo sapiens (Human)
Description:Q9Y5X9
Residue:500
BDBM151315
NameBDBM151315
Synonyms:BDBM151471 | US8987314, B113
TypeSmall organic molecule
Emp. Form.C29H29F3N4O8S3
Mol. Mass.714.753
SMILESCOCCNC(=O)c1ccc(cc1)-c1ccc2nc(sc2c1)C(C(=O)NCCS(N)(=O)=O)S(=O)(=O)Cc1ccc(OC(F)(F)F)cc1