Reaction Details
TargetEndothelial lipase
LigandBDBM151399
Substrate/Competitorn/a
Meas. Tech.Biological Assay
pH8±n/a
Temperature298.15±n/a K
IC50 0.6±n/a nM
Commentsextracted
Citation Finlay, HJiang, JKim, SParkhurst, BQiao, JXWang, TCPi, ZTora, GOLloyd, JJohnson, JA Amide, urea or sulfone amide linked benzothiazole inhibitors of endothelial lipase US Patent US8987314 Publication Date 3/24/2015
 
Endothelial lipase
Name:Endothelial lipase
Type:Protein
Mol. Mass.:56805.62
Organism:Homo sapiens (Human)
Description:Q9Y5X9
Residue:500
BDBM151399
NameBDBM151399
Synonyms:US8987314, B210
TypeSmall organic molecule
Emp. Form.C24H23N3O6S3
Mol. Mass.545.651
SMILESCS(=O)(=O)C(C(=O)NCCS(N)(=O)=O)c1nc2ccc(cc2s1)-c1cccc(Oc2ccccc2)c1