Reaction Details
TargetEndothelial lipase
LigandBDBM151401
Substrate/Competitorn/a
Meas. Tech.Biological Assay
pH8±n/a
Temperature298.15±n/a K
IC50 1.2±n/a nM
Commentsextracted
Citation Finlay, HJiang, JKim, SParkhurst, BQiao, JXWang, TCPi, ZTora, GOLloyd, JJohnson, JA Amide, urea or sulfone amide linked benzothiazole inhibitors of endothelial lipase US Patent US8987314 Publication Date 3/24/2015
 
Endothelial lipase
Name:Endothelial lipase
Type:Protein
Mol. Mass.:56805.62
Organism:Homo sapiens (Human)
Description:Q9Y5X9
Residue:500
BDBM151401
NameBDBM151401
Synonyms:US8987314, B212
TypeSmall organic molecule
Emp. Form.C21H23FN4O6S3
Mol. Mass.542.624
SMILESCN(C)C(=O)c1ccc(cc1F)-c1ccc2nc(sc2c1)C(C(=O)NCCS(N)(=O)=O)S(C)(=O)=O