Reaction Details
TargetEndothelial lipase
LigandBDBM151422
Substrate/Competitorn/a
Meas. Tech.Biological Assay
pH8±n/a
Temperature298.15±n/a K
IC50 31.6±n/a nM
Commentsextracted
Citation Finlay, HJiang, JKim, SParkhurst, BQiao, JXWang, TCPi, ZTora, GOLloyd, JJohnson, JA Amide, urea or sulfone amide linked benzothiazole inhibitors of endothelial lipase US Patent US8987314 Publication Date 3/24/2015
 
Endothelial lipase
Name:Endothelial lipase
Type:Protein
Mol. Mass.:56805.62
Organism:Homo sapiens (Human)
Description:Q9Y5X9
Residue:500
BDBM151422
NameBDBM151422
Synonyms:US8987314, B233
TypeSmall organic molecule
Emp. Form.C21H19N3O4S2
Mol. Mass.441.523
SMILESCc1cc(CNC(=O)C(c2nc3ccc(cc3s2)-c2ccccc2)S(C)(=O)=O)on1