Reaction Details
TargetEndothelial lipase
LigandBDBM151468
Substrate/Competitorn/a
Meas. Tech.Biological Assay
pH8±n/a
Temperature298.15±n/a K
IC50 15.6±n/a nM
Commentsextracted
Citation Finlay, HJiang, JKim, SParkhurst, BQiao, JXWang, TCPi, ZTora, GOLloyd, JJohnson, JA Amide, urea or sulfone amide linked benzothiazole inhibitors of endothelial lipase US Patent US8987314 Publication Date 3/24/2015
 
Endothelial lipase
Name:Endothelial lipase
Type:Protein
Mol. Mass.:56805.62
Organism:Homo sapiens (Human)
Description:Q9Y5X9
Residue:500
BDBM151468
NameBDBM151468
Synonyms:US8987314, B279
TypeSmall organic molecule
Emp. Form.C25H26N4O5S3
Mol. Mass.558.693
SMILESCc1nnc(CNC(=O)C(c2nc3ccc(cc3s2)-c2ccc(cc2)C(=O)OC(C)(C)C)S(C)(=O)=O)s1