Reaction Details
TargetEndothelial lipase
LigandBDBM151469
Substrate/Competitorn/a
Meas. Tech.Biological Assay
pH8±n/a
Temperature298.15±n/a K
IC50 4.8±n/a nM
Commentsextracted
Citation Finlay, HJiang, JKim, SParkhurst, BQiao, JXWang, TCPi, ZTora, GOLloyd, JJohnson, JA Amide, urea or sulfone amide linked benzothiazole inhibitors of endothelial lipase US Patent US8987314 Publication Date 3/24/2015
 
Endothelial lipase
Name:Endothelial lipase
Type:Protein
Mol. Mass.:56805.62
Organism:Homo sapiens (Human)
Description:Q9Y5X9
Residue:500
BDBM151469
NameBDBM151469
Synonyms:US8987314, B280
TypeSmall organic molecule
Emp. Form.C25H30FN3O7S3
Mol. Mass.599.715
SMILESCC(C)S(=O)(=O)C(C(=O)NCCS(N)(=O)=O)c1nc2c(F)cc(cc2s1)-c1cccc(c1)C(=O)OC(C)(C)C