Reaction Details
TargetEndothelial lipase
LigandBDBM151499
Substrate/Competitorn/a
Meas. Tech.Biological Assay
pH8±n/a
Temperature298.15±n/a K
IC50 1±n/a nM
Commentsextracted
Citation Finlay, HJiang, JKim, SParkhurst, BQiao, JXWang, TCPi, ZTora, GOLloyd, JJohnson, JA Amide, urea or sulfone amide linked benzothiazole inhibitors of endothelial lipase US Patent US8987314 Publication Date 3/24/2015
 
Endothelial lipase
Name:Endothelial lipase
Type:Protein
Mol. Mass.:56805.62
Organism:Homo sapiens (Human)
Description:Q9Y5X9
Residue:500
BDBM151499
NameBDBM151499
Synonyms:US8987314, B310
TypeSmall organic molecule
Emp. Form.C23H20F2N4O5S3
Mol. Mass.566.621
SMILESNS(=O)(=O)CCNC(=O)C(c1nc2cc(ccc2s1)-c1ccc(F)nc1)S(=O)(=O)Cc1ccc(F)cc1