Reaction Details
TargetEndothelial lipase
LigandBDBM151510
Substrate/Competitorn/a
Meas. Tech.Biological Assay
pH8±n/a
Temperature298.15±n/a K
IC50 0.6±n/a nM
Commentsextracted
Citation Finlay, HJiang, JKim, SParkhurst, BQiao, JXWang, TCPi, ZTora, GOLloyd, JJohnson, JA Amide, urea or sulfone amide linked benzothiazole inhibitors of endothelial lipase US Patent US8987314 Publication Date 3/24/2015
 
Endothelial lipase
Name:Endothelial lipase
Type:Protein
Mol. Mass.:56805.62
Organism:Homo sapiens (Human)
Description:Q9Y5X9
Residue:500
BDBM151510
NameBDBM151510
Synonyms:US8987314, B321
TypeSmall organic molecule
Emp. Form.C22H22F2N4O6S3
Mol. Mass.572.625
SMILESCS(=O)(=O)C(C(=O)NCCS(N)(=O)=O)c1nc2cc(ccc2s1)-c1ccc(cc1)C(=O)N1CC(F)(F)C1