Reaction Details
TargetHepatic triacylglycerol lipase
LigandBDBM151266
Substrate/Competitorn/a
Meas. Tech.Biological Assay
pH8±n/a
Temperature298.15±n/a K
IC50 1±n/a nM
Commentsextracted
Citation Finlay, HJiang, JKim, SParkhurst, BQiao, JXWang, TCPi, ZTora, GOLloyd, JJohnson, JA Amide, urea or sulfone amide linked benzothiazole inhibitors of endothelial lipase US Patent US8987314 Publication Date 3/24/2015
 
Hepatic triacylglycerol lipase
Name:Hepatic triacylglycerol lipase
Type:Protein
Mol. Mass.:55938.55
Organism:Homo sapiens (Human)
Description:P11150
Residue:499
BDBM151266
NameBDBM151266
Synonyms:US8987314, B62
TypeSmall organic molecule
Emp. Form.C22H26N4O5S3
Mol. Mass.522.661
SMILESCS(=O)(=O)C(C(=O)NCCS(N)(=O)=O)c1nc2ccc(cc2s1)-c1cccc(c1)N1CCCC1