Reaction Details
TargetHepatic triacylglycerol lipase
LigandBDBM151320
Substrate/Competitorn/a
Meas. Tech.Biological Assay
pH8±n/a
Temperature298.15±n/a K
IC50 10±n/a nM
Commentsextracted
Citation Finlay, HJiang, JKim, SParkhurst, BQiao, JXWang, TCPi, ZTora, GOLloyd, JJohnson, JA Amide, urea or sulfone amide linked benzothiazole inhibitors of endothelial lipase US Patent US8987314 Publication Date 3/24/2015
 
Hepatic triacylglycerol lipase
Name:Hepatic triacylglycerol lipase
Type:Protein
Mol. Mass.:55938.55
Organism:Homo sapiens (Human)
Description:P11150
Residue:499
BDBM151320
NameBDBM151320
Synonyms:US8987314, B118
TypeSmall organic molecule
Emp. Form.C21H23N3O5S3
Mol. Mass.493.619
SMILESNS(=O)(=O)CCNC(=O)C(c1nc2ccc(cc2s1)-c1ccccc1)S(=O)(=O)CC1CC1