Reaction Details
TargetHepatic triacylglycerol lipase
LigandBDBM151357
Substrate/Competitorn/a
Meas. Tech.Biological Assay
pH8±n/a
Temperature298.15±n/a K
IC50<10±n/a nM
Commentsextracted
Citation Finlay, HJiang, JKim, SParkhurst, BQiao, JXWang, TCPi, ZTora, GOLloyd, JJohnson, JA Amide, urea or sulfone amide linked benzothiazole inhibitors of endothelial lipase US Patent US8987314 Publication Date 3/24/2015
 
Hepatic triacylglycerol lipase
Name:Hepatic triacylglycerol lipase
Type:Protein
Mol. Mass.:55938.55
Organism:Homo sapiens (Human)
Description:P11150
Residue:499
BDBM151357
NameBDBM151357
Synonyms:US8987314, B155
TypeSmall organic molecule
Emp. Form.C22H21FN4O5S2
Mol. Mass.504.554
SMILESCOCCS(=O)(=O)C(C(=O)NCc1nnc(C)o1)c1nc2cc(F)c(cc2s1)-c1ccccc1