Reaction Details
TargetHepatic triacylglycerol lipase
LigandBDBM151416
Substrate/Competitorn/a
Meas. Tech.Biological Assay
pH8±n/a
Temperature298.15±n/a K
IC50 80.8±n/a nM
Commentsextracted
Citation Finlay, HJiang, JKim, SParkhurst, BQiao, JXWang, TCPi, ZTora, GOLloyd, JJohnson, JA Amide, urea or sulfone amide linked benzothiazole inhibitors of endothelial lipase US Patent US8987314 Publication Date 3/24/2015
 
Hepatic triacylglycerol lipase
Name:Hepatic triacylglycerol lipase
Type:Protein
Mol. Mass.:55938.55
Organism:Homo sapiens (Human)
Description:P11150
Residue:499
BDBM151416
NameBDBM151416
Synonyms:US8987314, B227
TypeSmall organic molecule
Emp. Form.C26H23F3N4O7S3
Mol. Mass.656.674
SMILESNC(=O)c1ccc(cc1)-c1ccc2nc(sc2c1)C(C(=O)NCCS(N)(=O)=O)S(=O)(=O)Cc1ccc(OC(F)(F)F)cc1