Reaction Details
TargetProteinase-activated receptor 4
LigandBDBM286446
Substrate/Competitorn/a
Meas. Tech.FLIPR Assay
Temperature298.15±n/a K
IC50 0.840±n/a nM
Commentsextracted
Citation Martel, ATremblay, FMarinier, APriestley, ESPosy, SLLawrence, RMMiller, MM Imidazothiadiazole and imidazopyridazine derivatives as protease activated receptor 4 (PAR4) inhibitors for treating platelet aggregation US Patent US9518064 Publication Date 12/13/2016
 
Proteinase-activated receptor 4
Name:Proteinase-activated receptor 4
Type:Protein
Mol. Mass.:41145.16
Organism:Homo sapiens (Human)
Description:Q96RI0
Residue:385
BDBM286446
NameBDBM286446
Synonyms:6-(4-((3-Fluoro-5-(5-methoxypyridin-2-yl)benzyl)oxy)-6-methoxybenzofuran-2-yl)-2-methoxyimidazo[2,1-b][1,3,4]thiadiazole | US9518064, Example 62
TypeSmall organic molecule
Emp. Form.C27H21FN4O5S
Mol. Mass.532.543
SMILESCOc1nn2cc(nc2s1)-c1cc2c(OCc3cc(F)cc(c3)-c3ccc(OC)cn3)cc(OC)cc2o1