Reaction Details
TargetAcetylcholinesterase
LigandBDBM152502
Substrate/Competitorn/a
Meas. Tech.Acetylcholinesterase Inhibition Assay
pH8±n/a
Ki 4.25±0.0 nM
IC50 7.21±0.0 nM
Commentsextracted
Citation Öztaskin, NÇetinkaya, YTaslimi, PGöksu, SGülçin, Ä° Antioxidant and acetylcholinesterase inhibition properties of novel bromophenol derivatives. Bioorg Chem60:49-57 (2015) 
 
Acetylcholinesterase
Name:Acetylcholinesterase
Type:Enzyme
Mol. Mass.:67792.70
Organism:Homo sapiens (Human)
Description:P22303
Residue:614
BDBM152502
NameBDBM152502
Synonyms:2-bromo-1,4-dimethoxybenzene (14)
TypeSmall organic molecule
Emp. Form.C8H9BrO2
Mol. Mass.217.06
SMILESCOc1ccc(OC)c(Br)c1