Reaction Details
TargetAcetylcholinesterase
LigandBDBM152504
Substrate/Competitorn/a
Meas. Tech.Acetylcholinesterase Inhibition Assay
pH8±n/a
Ki 5.28±0.0 nM
IC50 4.68±0.0 nM
Commentsextracted
Citation Öztaskin, NÇetinkaya, YTaslimi, PGöksu, SGülçin, Ä° Antioxidant and acetylcholinesterase inhibition properties of novel bromophenol derivatives. Bioorg Chem60:49-57 (2015) 
 
Acetylcholinesterase
Name:Acetylcholinesterase
Type:Enzyme
Mol. Mass.:67792.70
Organism:Homo sapiens (Human)
Description:P22303
Residue:614
BDBM152504
NameBDBM152504
Synonyms:(4-Bromo-2,5-dimethoxyphenyl)(phenyl)methanone (16)
TypeSmall organic molecule
Emp. Form.C15H13BrO3
Mol. Mass.321.166
SMILESCOc1cc(C(=O)c2ccccc2)c(OC)cc1Br