Reaction Details
TargetAcetylcholinesterase
LigandBDBM152507
Substrate/Competitorn/a
Meas. Tech.Acetylcholinesterase Inhibition Assay
pH8±n/a
Ki 4.06±0.0 nM
IC50 4.71±0.0 nM
Commentsextracted
Citation Öztaskin, NÇetinkaya, YTaslimi, PGöksu, SGülçin, Ä° Antioxidant and acetylcholinesterase inhibition properties of novel bromophenol derivatives. Bioorg Chem60:49-57 (2015) 
 
Acetylcholinesterase
Name:Acetylcholinesterase
Type:Enzyme
Mol. Mass.:67792.70
Organism:Homo sapiens (Human)
Description:P22303
Residue:614
BDBM152507
NameBDBM152507
Synonyms:(2-bromo-4-hydroxyphenyl)(3,4-dihydroxyphenyl)methanone (20)
TypeSmall organic molecule
Emp. Form.C13H9BrO4
Mol. Mass.309.112
SMILESOc1ccc(C(=O)c2ccc(O)c(O)c2)c(Br)c1