Reaction Details
TargetAcetylcholinesterase
LigandBDBM152509
Substrate/Competitorn/a
Meas. Tech.Acetylcholinesterase Inhibition Assay
pH8±n/a
Ki 2.78±0.0 nM
IC50 4.58±0.0 nM
Commentsextracted
Citation Öztaskin, NÇetinkaya, YTaslimi, PGöksu, SGülçin, Ä° Antioxidant and acetylcholinesterase inhibition properties of novel bromophenol derivatives. Bioorg Chem60:49-57 (2015) 
 
Acetylcholinesterase
Name:Acetylcholinesterase
Type:Enzyme
Mol. Mass.:67792.70
Organism:Homo sapiens (Human)
Description:P22303
Residue:614
BDBM152509
NameBDBM152509
Synonyms:(4-Bromo-2,5-dihydroxyphenyl)(4-hydroxyphenyl)methanone (22)
TypeSmall organic molecule
Emp. Form.C13H9BrO4
Mol. Mass.309.112
SMILESOc1ccc(cc1)C(=O)c1cc(O)c(Br)cc1O