Reaction Details
TargetAcetylcholinesterase
LigandBDBM152511
Substrate/Competitorn/a
Meas. Tech.Acetylcholinesterase Inhibition Assay
pH8±n/a
Ki 5.72±0.0 nM
IC50 4.81±0.0 nM
Commentsextracted
Citation Öztaskin, NÇetinkaya, YTaslimi, PGöksu, SGülçin, Ä° Antioxidant and acetylcholinesterase inhibition properties of novel bromophenol derivatives. Bioorg Chem60:49-57 (2015) 
 
Acetylcholinesterase
Name:Acetylcholinesterase
Type:Enzyme
Mol. Mass.:67792.70
Organism:Homo sapiens (Human)
Description:P22303
Residue:614
BDBM152511
NameBDBM152511
Synonyms:(5-Bromo-2,4-dihydroxyphenyl)(4-hydroxyphenyl)methanone (24)
TypeSmall organic molecule
Emp. Form.C13H9BrO4
Mol. Mass.309.112
SMILESOc1ccc(cc1)C(=O)c1cc(Br)c(O)cc1O