Reaction Details
TargetMetabotropic glutamate receptor 5
LigandBDBM143699
Substrate/Competitorn/a
Meas. Tech.Enzyme inhibition assay
Ki 280±n/a nM
Citation Jaeschke, GLindemann, LMartin, RERicci, ARueher, DStadler, HVieira, E Ethynyl derivatives US Patent US9682959 Publication Date 6/20/2017
 
Metabotropic glutamate receptor 5
Name:Metabotropic glutamate receptor 5
Type:Enzyme
Mol. Mass.:132484.72
Organism:Homo sapiens (Human)
Description:n/a
Residue:1212
BDBM143699
NameBDBM143699
Synonyms:US9682959, 6 | US9751856, 6
TypeSmall organic molecule
Emp. Form.C18H15FN4O
Mol. Mass.322.3363
SMILESCN1C(=O)C(C)(C)N=C1c1ncc(cn1)C#Cc1cccc(F)c1