Reaction Details
TargetBeta-lactamase
LigandBDBM152733
Substrate/Competitorn/a
Meas. Tech.Steady State Kinetics
pH7.2±n/a
Ki 2e+2±n/a nM
Commentsextracted
Citation Hazra, SKurz, SGWolff, KNguyen, LBonomo, RABlanchard, JS Kinetic and Structural Characterization of the Interaction of 6-Methylidene Penem 2 with the ß-Lactamase from Mycobacterium tuberculosis. Biochemistry54:5657-64 (2015) 
 
Beta-lactamase
Name:Beta-lactamase
Type:Protein
Mol. Mass.:32565.98
Organism:Mycobacterium tuberculosis H37Rv
Description:n/a
Residue:307
BDBM152733
NameBDBM152733
Synonyms:Penem 2
TypeSmall organic molecule
Emp. Form.C13H10N3O3S2
Mol. Mass.320.367
SMILES[O-]C(=O)C1=CSC2N1C(=O)\C2=C\c1cc2CCSCn2n1