Reaction Details
TargetAcetyl-CoA carboxylase 2
LigandBDBM152869
Substrate/Competitorn/a
Meas. Tech.Inhibition Assay
IC50 2.7±n/a nM
Citation Griffith, DADow, RLBagley, SWSmith, A N1/N2-lactam acetyl-CoA carboxylase inhibitors US Patent US8993586 Publication Date 3/31/2015
 
Acetyl-CoA carboxylase 2
Name:Acetyl-CoA carboxylase 2
Type:Protein
Mol. Mass.:276535.21
Organism:Homo sapiens (Human)
Description:O00763
Residue:2458
BDBM152869
NameBDBM152869
Synonyms:US8993586, 47
TypeSmall organic molecule
Emp. Form.C24H32N6O3
Mol. Mass.452.5493
SMILESCC1=NNC2C1C=C(C=C2C)C(=O)N1CCC2(CC1)Cc1cn(CC(C)(C)O)nc1C(=O)N2