Reaction Details
TargetAcetyl-CoA carboxylase 2
LigandBDBM50439641
Substrate/Competitorn/a
Meas. Tech.Inhibition Assay
IC50 2.6±n/a nM
Citation Griffith, DADow, RLBagley, SWSmith, A N1/N2-lactam acetyl-CoA carboxylase inhibitors US Patent US8993586 Publication Date 3/31/2015
 
Acetyl-CoA carboxylase 2
Name:Acetyl-CoA carboxylase 2
Type:Protein
Mol. Mass.:276535.21
Organism:Homo sapiens (Human)
Description:O00763
Residue:2458
BDBM50439641
NameBDBM50439641
Synonyms:CHEMBL2419597 | US8993586, 55
TypeSmall organic molecule
Emp. Form.C25H29N5O3
Mol. Mass.447.5295
SMILESCOc1nccc2ccc(cc12)C(=O)N1CCC2(CC1)Cc1cn(nc1C(=O)N2)C(C)(C)C