Reaction Details
TargetAcetyl-CoA carboxylase 2
LigandBDBM152882
Substrate/Competitorn/a
Meas. Tech.Inhibition Assay
IC50 2.1±n/a nM
Citation Griffith, DADow, RLBagley, SWSmith, A N1/N2-lactam acetyl-CoA carboxylase inhibitors US Patent US8993586 Publication Date 3/31/2015
 
Acetyl-CoA carboxylase 2
Name:Acetyl-CoA carboxylase 2
Type:Protein
Mol. Mass.:276535.21
Organism:Homo sapiens (Human)
Description:O00763
Residue:2458
BDBM152882
NameBDBM152882
Synonyms:US8993586, 62
TypeSmall organic molecule
Emp. Form.C23H27ClN6O2
Mol. Mass.454.952
SMILESCc1cc(cc2c(Cl)n[nH]c12)C(=O)N1CCC2(CC1)Cc1cn(nc1C(=O)N2)C(C)(C)C