Reaction Details
TargetAcetyl-CoA carboxylase 2
LigandBDBM152885
Substrate/Competitorn/a
Meas. Tech.Inhibition Assay
IC50 2.4±n/a nM
Citation Griffith, DADow, RLBagley, SWSmith, A N1/N2-lactam acetyl-CoA carboxylase inhibitors US Patent US8993586 Publication Date 3/31/2015
 
Acetyl-CoA carboxylase 2
Name:Acetyl-CoA carboxylase 2
Type:Protein
Mol. Mass.:276535.21
Organism:Homo sapiens (Human)
Description:O00763
Residue:2458
BDBM152885
NameBDBM152885
Synonyms:US8993586, 66
TypeSmall organic molecule
Emp. Form.C23H28N6O3
Mol. Mass.436.5068
SMILESCOc1cc(cc2[nH]ncc12)C(=O)N1CCC2(CC1)Cc1cn(nc1C(=O)N2)C(C)(C)C