Reaction Details
TargetAcetyl-CoA carboxylase 2
LigandBDBM152926
Substrate/Competitorn/a
Meas. Tech.Inhibition Assay
IC50 1.72±n/a nM
Citation Griffith, DADow, RLBagley, SWSmith, A N1/N2-lactam acetyl-CoA carboxylase inhibitors US Patent US8993586 Publication Date 3/31/2015
 
Acetyl-CoA carboxylase 2
Name:Acetyl-CoA carboxylase 2
Type:Protein
Mol. Mass.:276535.21
Organism:Homo sapiens (Human)
Description:O00763
Residue:2458
BDBM152926
NameBDBM152926
Synonyms:US8993586, 124
TypeSmall organic molecule
Emp. Form.C26H29F3N6O2
Mol. Mass.514.5427
SMILESCC(C)(C)n1cc2CC3(CCN(CC3)C(=O)c3ccc4ccc(NCC(F)(F)F)nc4c3)NC(=O)c2n1