Reaction Details
TargetMembrane metallo-endopeptidase-like 1
LigandBDBM138393
Substrate/Competitorn/a
Meas. Tech.Inhibition Assay
pH7.4±n/a
Temperature298.15±n/a K
IC50 2.4±n/a nM
Commentsextracted
Citation Foo, SY Method of treating contrast-induced nephropathy US Patent US8993631 Publication Date 3/31/2015
 
Membrane metallo-endopeptidase-like 1
Name:Membrane metallo-endopeptidase-like 1
Type:Enzyme
Mol. Mass.:89358.76
Organism:Homo sapiens (Human)
Description:Q495T6
Residue:779
BDBM138393
NameBDBM138393
Synonyms:US8877786, Example 3-7 | US8993631, 32-4
TypeSmall organic molecule
Emp. Form.C21H20ClN3O5
Mol. Mass.429.854
SMILESC[C@H](N[C@@H](Cc1ccc(cc1)-c1cccc(Cl)c1)C(=O)Nc1cc(O)no1)C(O)=O