Reaction Details
TargetAurora kinase B
LigandBDBM153264
Substrate/Competitorn/a
Meas. Tech.Aurora B Kinase Assay
IC50 1.107e+4±n/a nM
Citation Jung, YShin, SYYong, YJung, HAhn, SLee, YHLim, Y Plant-derived flavones as inhibitors of aurora B kinase and their quantitative structure-activity relationships. Chem Biol Drug Des85:574-85 (2015) 
 
Aurora kinase B
Name:Aurora kinase B
Type:Protein
Mol. Mass.:39327.72
Organism:Homo sapiens (Human)
Description:Q96GD4
Residue:344
BDBM153264
NameBDBM153264
Synonyms:2-(3,4-dihydroxyphenyl)-3,5,7-trihydroxy-8-[(2S,3R,4S,5S,6R)-3,4,5-trihydroxy-6-(hydroxymethyl)oxan-2-yl]oxychromen-4-one | Gossypin (4)
TypeSmall organic molecule
Emp. Form.C21H20O13
Mol. Mass.480.3757
SMILESOC[C@H]1O[C@@H](Oc2c(O)cc(O)c3c2oc(-c2ccc(O)c(O)c2)c(O)c3=O)[C@H](O)[C@@H](O)[C@@H]1O