Reaction Details
TargetAurora kinase B
LigandBDBM50009001
Substrate/Competitorn/a
Meas. Tech.Aurora B Kinase Assay
IC50 4.06e+3±n/a nM
Citation Jung, YShin, SYYong, YJung, HAhn, SLee, YHLim, Y Plant-derived flavones as inhibitors of aurora B kinase and their quantitative structure-activity relationships. Chem Biol Drug Des85:574-85 (2015) 
 
Aurora kinase B
Name:Aurora kinase B
Type:Protein
Mol. Mass.:39327.72
Organism:Homo sapiens (Human)
Description:Q96GD4
Residue:344
BDBM50009001
NameBDBM50009001
Synonyms:5,6,7-Trihydroxyflavone Baicalein Baicalein, 8 US10252984, Table 2.33
TypeSmall organic molecule
Emp. Form.C15H10O5
Mol. Mass.270.2369
SMILESOc1cc2oc(cc(=O)c2c(O)c1O)-c1ccccc1