Reaction Details
TargetDecaprenyl diphosphate synthase
LigandBDBM153303
Substrate/Competitorn/a
Meas. Tech.DPPS Inhibition (GPP based) Assay
pH7.5±n/a
IC50 41±n/a nM
Commentsextracted
Citation Kim, MOFeng, XFeixas, FZhu, WLindert, SBogue, SSinko, Wde Oliveira, CRao, GOldfield, EMcCammon, JA A Molecular Dynamics Investigation of Mycobacterium tuberculosis Prenyl Synthases: Conformational Flexibility and Implications for Computer-aided Drug Discovery. Chem Biol Drug Des85:756-69 (2015) 
 
Decaprenyl diphosphate synthase
Name:Decaprenyl diphosphate synthase
Type:Protein
Mol. Mass.:33800.02
Organism:Mycobacterium tuberculosis H37Rv
Description:n/a
Residue:296
BDBM153303
NameBDBM153303
Synonyms:BPH-1256
TypeSmall organic molecule
Emp. Form.C24H32N2O6S
Mol. Mass.476.586
SMILESCCCCCCCCCCOc1cccc(c1)C(=O)Nc1ccc(cc1C(O)=O)S(N)(=O)=O