Reaction Details
TargetDecaprenyl diphosphate synthase
LigandBDBM153304
Substrate/Competitorn/a
Meas. Tech.DPPS Inhibition (GPP based) Assay
pH7.5±n/a
IC50 43±n/a nM
Commentsextracted
Citation Kim, MOFeng, XFeixas, FZhu, WLindert, SBogue, SSinko, Wde Oliveira, CRao, GOldfield, EMcCammon, JA A Molecular Dynamics Investigation of Mycobacterium tuberculosis Prenyl Synthases: Conformational Flexibility and Implications for Computer-aided Drug Discovery. Chem Biol Drug Des85:756-69 (2015) 
 
Decaprenyl diphosphate synthase
Name:Decaprenyl diphosphate synthase
Type:Protein
Mol. Mass.:33800.02
Organism:Mycobacterium tuberculosis H37Rv
Description:n/a
Residue:296
BDBM153304
NameBDBM153304
Synonyms:BPH-1477
TypeSmall organic molecule
Emp. Form.C23H30F3NO5
Mol. Mass.457.4832
SMILESCCCCCCCCO\C(=C\CC(=O)Nc1ccc(OC(F)(F)F)cc1C(O)=O)\C=C/C