Reaction Details
TargetDecaprenyl diphosphate synthase
LigandBDBM153309
Substrate/Competitorn/a
Meas. Tech.DPPS Inhibition (GPP based) Assay
pH7.5±n/a
IC50 156±n/a nM
Commentsextracted
Citation Kim, MOFeng, XFeixas, FZhu, WLindert, SBogue, SSinko, Wde Oliveira, CRao, GOldfield, EMcCammon, JA A Molecular Dynamics Investigation of Mycobacterium tuberculosis Prenyl Synthases: Conformational Flexibility and Implications for Computer-aided Drug Discovery. Chem Biol Drug Des85:756-69 (2015) 
 
Decaprenyl diphosphate synthase
Name:Decaprenyl diphosphate synthase
Type:Protein
Mol. Mass.:33800.02
Organism:Mycobacterium tuberculosis H37Rv
Description:n/a
Residue:296
BDBM153309
NameBDBM153309
Synonyms:BPH-1466
TypeSmall organic molecule
Emp. Form.C22H26ClNO4
Mol. Mass.403.899
SMILESCCCCCCCCOc1cccc(c1)C(=O)Nc1ccc(Cl)cc1C(O)=O