Reaction Details
TargetDecaprenyl diphosphate synthase
LigandBDBM153320
Substrate/Competitorn/a
Meas. Tech.DPPS Inhibition (GPP based) Assay
pH7.5±n/a
IC50 7.0e+2±n/a nM
Commentsextracted
Citation Kim, MOFeng, XFeixas, FZhu, WLindert, SBogue, SSinko, Wde Oliveira, CRao, GOldfield, EMcCammon, JA A Molecular Dynamics Investigation of Mycobacterium tuberculosis Prenyl Synthases: Conformational Flexibility and Implications for Computer-aided Drug Discovery. Chem Biol Drug Des85:756-69 (2015) 
 
Decaprenyl diphosphate synthase
Name:Decaprenyl diphosphate synthase
Type:Protein
Mol. Mass.:33800.02
Organism:Mycobacterium tuberculosis H37Rv
Description:n/a
Residue:296
BDBM153320
NameBDBM153320
Synonyms:BPH-1150
TypeSmall organic molecule
Emp. Form.C24H32O4
Mol. Mass.384.5085
SMILESCCCCCCCCCCOc1cccc(COc2ccccc2C(O)=O)c1