Reaction Details
TargetDecaprenyl diphosphate synthase
LigandBDBM153328
Substrate/Competitorn/a
Meas. Tech.DPPS Inhibition (GPP based) Assay
pH7.5±n/a
IC50 2.6e+3±n/a nM
Commentsextracted
Citation Kim, MOFeng, XFeixas, FZhu, WLindert, SBogue, SSinko, Wde Oliveira, CRao, GOldfield, EMcCammon, JA A Molecular Dynamics Investigation of Mycobacterium tuberculosis Prenyl Synthases: Conformational Flexibility and Implications for Computer-aided Drug Discovery. Chem Biol Drug Des85:756-69 (2015) 
 
Decaprenyl diphosphate synthase
Name:Decaprenyl diphosphate synthase
Type:Protein
Mol. Mass.:33800.02
Organism:Mycobacterium tuberculosis H37Rv
Description:n/a
Residue:296
BDBM153328
NameBDBM153328
Synonyms:BPH-1389
TypeSmall organic molecule
Emp. Form.C19H29O6P
Mol. Mass.384.4037
SMILESCCCCCCCCOc1cccc(c1)P(=O)(CC(=O)C(O)=O)OCC