Reaction Details
TargetDecaprenyl diphosphate synthase
LigandBDBM153367
Substrate/Competitorn/a
Meas. Tech.DPPS Inhibition (trans FPP based) Assay
pH7.5±n/a
IC50 3.8e+3±n/a nM
Commentsextracted
Citation Kim, MOFeng, XFeixas, FZhu, WLindert, SBogue, SSinko, Wde Oliveira, CRao, GOldfield, EMcCammon, JA A Molecular Dynamics Investigation of Mycobacterium tuberculosis Prenyl Synthases: Conformational Flexibility and Implications for Computer-aided Drug Discovery. Chem Biol Drug Des85:756-69 (2015) 
 
Decaprenyl diphosphate synthase
Name:Decaprenyl diphosphate synthase
Type:Protein
Mol. Mass.:33800.02
Organism:Mycobacterium tuberculosis H37Rv
Description:n/a
Residue:296
BDBM153367
NameBDBM153367
Synonyms:BPH-780
TypeSmall organic molecule
Emp. Form.C24H23NO9P2S
Mol. Mass.563.453
SMILESOC(Cc1ccc(cc1)-c1cccc(NS(=O)(=O)c2ccc3ccccc3c2)c1)(P(O)(O)=O)P(O)(O)=O