Reaction Details
TargetPolyunsaturated fatty acid lipoxygenase ALOX15B
LigandBDBM153380
Substrate/Competitorn/a
Meas. Tech.IC50 Assay
pH7.3±n/a
Temperature298.15±n/a K
IC50 8.3e+3± 9e+2 nM
Commentsextracted
Citation Mascayano, CEspinosa, VSepúlveda-Boza, SHoobler, EKPerry, SDiaz, GHolman, TR Enzymatic Studies of Isoflavonoids as Selective and Potent Inhibitors of Human Leukocyte 5-Lipo-Oxygenase. Chem Biol Drug Des86:114-21 (2015) 
 
Polyunsaturated fatty acid lipoxygenase ALOX15B
Name:Polyunsaturated fatty acid lipoxygenase ALOX15B
Type:Protein
Mol. Mass.:75850.40
Organism:Homo sapiens (Human)
Description:n/a
Residue:676
BDBM153380
NameBDBM153380
Synonyms:HIR-9
TypeSmall organic molecule
Emp. Form.C16H16O3
Mol. Mass.256.2964
SMILESCc1cccc(c1)C1COc2cc(O)c(O)cc2C1