Reaction Details
TargetPolyunsaturated fatty acid lipoxygenase ALOX15B
LigandBDBM106787
Substrate/Competitorn/a
Meas. Tech.IC50 Assay
pH7.3±n/a
Temperature298.15±n/a K
IC50 3.4e+4± 7e+3 nM
Commentsextracted
Citation Mascayano, CEspinosa, VSepúlveda-Boza, SHoobler, EKPerry, SDiaz, GHolman, TR Enzymatic Studies of Isoflavonoids as Selective and Potent Inhibitors of Human Leukocyte 5-Lipo-Oxygenase. Chem Biol Drug Des86:114-21 (2015) 
 
Polyunsaturated fatty acid lipoxygenase ALOX15B
Name:Polyunsaturated fatty acid lipoxygenase ALOX15B
Type:Protein
Mol. Mass.:75850.40
Organism:Homo sapiens (Human)
Description:n/a
Residue:676
BDBM106787
NameBDBM106787
Synonyms:3‐(4‐methylphenyl)‐3,4‐dihydro‐2H‐1‐benzopyran‐7,8‐ diol HIR-303
TypeSmall organic molecule
Emp. Form.C16H16O3
Mol. Mass.256.2964
SMILESCc1ccc(cc1)C1COc2c(C1)ccc(O)c2O