Reaction Details
TargetPolyunsaturated fatty acid 5-lipoxygenase
LigandBDBM153382
Substrate/Competitorn/a
Meas. Tech.IC50 Assay
pH7.3±n/a
Temperature298.15±n/a K
IC50 7.1e+3± 9e+2 nM
Commentsextracted
Citation Mascayano, CEspinosa, VSepúlveda-Boza, SHoobler, EKPerry, SDiaz, GHolman, TR Enzymatic Studies of Isoflavonoids as Selective and Potent Inhibitors of Human Leukocyte 5-Lipo-Oxygenase. Chem Biol Drug Des86:114-21 (2015) 
 
Polyunsaturated fatty acid 5-lipoxygenase
Name:Polyunsaturated fatty acid 5-lipoxygenase
Type:Enzyme
Mol. Mass.:77972.74
Organism:Homo sapiens (Human)
Description:Recombinant protein was purified from E. coli lysate. After ammonium sulfate precipitation and subsequent steps, the supernatant (S100) was used for 5-LO activity assay.
Residue:674
BDBM153382
NameBDBM153382
Synonyms:HIR-205
TypeSmall organic molecule
Emp. Form.C16H15ClO2
Mol. Mass.274.742
SMILESCc1c(O)ccc2CC(COc12)c1ccc(Cl)cc1