Reaction Details
TargetPhosphodiesterase
LigandBDBM153391
Substrate/Competitorn/a
Meas. Tech.TbrPDEB1 Enzyme Assay
pH7.4±n/a
IC50 2.9e+3± 8e+2 nM
Commentsextracted
Citation Ochiana, SOBland, NDSettimo, LCampbell, RKPollastri, MP Repurposing human PDE4 inhibitors for neglected tropical diseases. Evaluation of analogs of the human PDE4 inhibitor GSK-256066 as inhibitors of PDEB1 of Trypanosoma brucei. Chem Biol Drug Des85:549-64 (2015) 
 
Phosphodiesterase
Name:Phosphodiesterase
Type:Protein
Mol. Mass.:103683.20
Organism:Trypanosoma brucei
Description:n/a
Residue:930
BDBM153391
NameBDBM153391
Synonyms:3-(3-carbamoyl-4-(3-methoxyphenylamino)-8-methylquinolin-6-ylsulfonyl)benzoic acid (11)
TypeSmall organic molecule
Emp. Form.C25H21N3O6S
Mol. Mass.491.516
SMILESCOc1cccc(Nc2c(cnc3c(C)cc(cc23)S(=O)(=O)c2cccc(c2)C(O)=O)C(N)=O)c1