Reaction Details
TargetPhosphodiesterase
LigandBDBM153403
Substrate/Competitorn/a
Meas. Tech.TbrPDEB1 Enzyme Assay
pH7.4±n/a
IC50 2.8e+4± 3.4e+3 nM
Commentsextracted
Citation Ochiana, SOBland, NDSettimo, LCampbell, RKPollastri, MP Repurposing human PDE4 inhibitors for neglected tropical diseases. Evaluation of analogs of the human PDE4 inhibitor GSK-256066 as inhibitors of PDEB1 of Trypanosoma brucei. Chem Biol Drug Des85:549-64 (2015) 
 
Phosphodiesterase
Name:Phosphodiesterase
Type:Protein
Mol. Mass.:103683.20
Organism:Trypanosoma brucei
Description:n/a
Residue:930
BDBM153403
NameBDBM153403
Synonyms:Methyl 3-(4-(benzylamino)-3-carbamoyl-8-methylquinolin-6-yl)benzoate (22c)
TypeSmall organic molecule
Emp. Form.C26H23N3O3
Mol. Mass.425.4791
SMILESCOC(=O)c1cccc(c1)-c1cc(C)c2ncc(C(N)=O)c(NCc3ccccc3)c2c1