Reaction Details
TargetProtein kinase C beta type
LigandBDBM153853
Substrate/Competitorn/a
Meas. Tech.Inhibition Assay
pH7.4±n/a
Temperature303.15±n/a K
Ki 13.3±n/a nM
Commentsextracted
Citation Botrous, IHong, YLi, HLiu, KKNukui, STeng, MTompkins, EVYin, C 3-amido-pyrrolo[3,4-C]pyrazole-5(1H, 4H,6H) carbaldehyde derivatives US Patent US8999981 Publication Date 4/7/2015
 
Protein kinase C beta type
Name:Protein kinase C beta type
Type:Enzyme
Mol. Mass.:76873.67
Organism:Homo sapiens (Human)
Description:The recombinant human PKC enzymes were produced using a baculovirus expression system in SF9 cells
Residue:671
BDBM153853
NameBDBM153853
Synonyms:US8999981, A122 | US8999981, A98
TypeSmall organic molecule
Emp. Form.C24H35N7O2
Mol. Mass.453.5804
SMILESC.C[C@H]1CN(CC2CC2)CCN1C(=O)N1Cc2c(NC(=O)c3ccccn3)n[nH]c2C1(C)C