Reaction Details
TargetProtein kinase C beta type
LigandBDBM153902
Substrate/Competitorn/a
Meas. Tech.Inhibition Assay
pH7.4±n/a
Temperature303.15±n/a K
Ki<10±n/a nM
Commentsextracted
Citation Botrous, IHong, YLi, HLiu, KKNukui, STeng, MTompkins, EVYin, C 3-amido-pyrrolo[3,4-C]pyrazole-5(1H, 4H,6H) carbaldehyde derivatives US Patent US8999981 Publication Date 4/7/2015
 
Protein kinase C beta type
Name:Protein kinase C beta type
Type:Enzyme
Mol. Mass.:76873.67
Organism:Homo sapiens (Human)
Description:The recombinant human PKC enzymes were produced using a baculovirus expression system in SF9 cells
Residue:671
BDBM153902
NameBDBM153902
Synonyms:US8999981, A147
TypeSmall organic molecule
Emp. Form.C25H35N7O3
Mol. Mass.481.5905
SMILESC[C@@H]1CN([C@@H](C)CN1CC1CCOC1)C(=O)N1Cc2c(NC(=O)c3ccccn3)n[nH]c2C1(C)C