Reaction Details
TargetProtein kinase C beta type
LigandBDBM153973
Substrate/Competitorn/a
Meas. Tech.Inhibition Assay
pH7.4±n/a
Temperature303.15±n/a K
Ki<10±n/a nM
Commentsextracted
Citation Botrous, IHong, YLi, HLiu, KKNukui, STeng, MTompkins, EVYin, C 3-amido-pyrrolo[3,4-C]pyrazole-5(1H, 4H,6H) carbaldehyde derivatives US Patent US8999981 Publication Date 4/7/2015
 
Protein kinase C beta type
Name:Protein kinase C beta type
Type:Enzyme
Mol. Mass.:76873.67
Organism:Homo sapiens (Human)
Description:The recombinant human PKC enzymes were produced using a baculovirus expression system in SF9 cells
Residue:671
BDBM153973
NameBDBM153973
Synonyms:US8999981, F29
TypeSmall organic molecule
Emp. Form.C27H41N7O4
Mol. Mass.527.6589
SMILESC.COc1ccc(nc1)C(=O)Nc1n[nH]c2c1CN(C(=O)N1CCN(CC3CCOCC3)C[C@@H]1C)C2(C)C