Reaction Details
TargetSodium channel protein type 9 subunit alpha
LigandBDBM154311
Substrate/Competitorn/a
Meas. Tech.In Vitro PX Assay
IC50 23±n/a nM
Citation Boezio, CBregman, HCoats, JRDimauro, EFDineen, TDu, BGraceffa, RKreiman, CLa, DMarx, IEChakka, NNguyen, HNPeterson, EAWeiss, MCopeland, KWDeak, HLBoezio, A Bicyclic aryl and heteroaryl sodium channel inhibitors US Patent US9012443 Publication Date 4/21/2015
 
Sodium channel protein type 9 subunit alpha
Name:Sodium channel protein type 9 subunit alpha
Type:Protein
Mol. Mass.:226375.97
Organism:Homo sapiens (Human)
Description:Q15858
Residue:1988
BDBM154311
NameBDBM154311
Synonyms:US9012443, 331
TypeSmall organic molecule
Emp. Form.C24H16ClFN4O3S2
Mol. Mass.526.99
SMILESCOc1cc(c(Cl)cc1-c1nccc2cc(ccc12)S(=O)(=O)Nc1ncns1)-c1cccc(F)c1