Reaction Details
TargetSodium channel protein type 5 subunit alpha
LigandBDBM154245
Substrate/Competitorn/a
Meas. Tech.In Vitro PX Assay
IC50>30000±n/a nM
Citation Boezio, CBregman, HCoats, JRDimauro, EFDineen, TDu, BGraceffa, RKreiman, CLa, DMarx, IEChakka, NNguyen, HNPeterson, EAWeiss, MCopeland, KWDeak, HLBoezio, A Bicyclic aryl and heteroaryl sodium channel inhibitors US Patent US9012443 Publication Date 4/21/2015
 
Sodium channel protein type 5 subunit alpha
Name:Sodium channel protein type 5 subunit alpha
Type:Enzyme
Mol. Mass.:226908.60
Organism:Homo sapiens (Human)
Description:Q14524
Residue:2016
BDBM154245
NameBDBM154245
Synonyms:US9012443, 261
TypeSmall organic molecule
Emp. Form.C19H13F3N4O3S2
Mol. Mass.466.457
SMILESCOc1cc(ccc1-c1ncnc2cc(ccc12)S(=O)(=O)Nc1nccs1)C(F)(F)F