Reaction Details
Target3-hydroxy-3-methylglutaryl-coenzyme A reductase
LigandBDBM155379
Substrate/Competitorn/a
Meas. Tech.Reductase Assay
pH7.2±n/a
IC50 2±n/a nM
Commentsextracted
Citation Lindsay, DJackson, PHindley, SBhamra, I Rosuvastatin and atorvastatin derivatives US Patent US9006282 Publication Date 4/14/2015
 
3-hydroxy-3-methylglutaryl-coenzyme A reductase
Name:3-hydroxy-3-methylglutaryl-coenzyme A reductase
Type:Enzyme
Mol. Mass.:96689.85
Organism:Rattus norvegicus (rat)
Description:Isolated rat liver microsomes were used as enzyme source.
Residue:887
BDBM155379
NameBDBM155379
Synonyms:US9006282, Example 2, Compound 7 | US9102656, Example 2, Compound 7
TypeSmall organic molecule
Emp. Form.C31H35Cl3FN3O5S
Mol. Mass.687.049
SMILESCC(C)c1nc(nc(-c2ccc(F)cc2)c1\C=C\[C@@H]1C[C@H](CC(OCC(Cl)(Cl)Cl)O1)OCc1ccccc1)N(C)S(C)(=O)=O