Reaction Details
Target3-hydroxy-3-methylglutaryl-coenzyme A reductase
LigandBDBM155380
Substrate/Competitorn/a
Meas. Tech.Reductase Assay
pH7.2±n/a
IC50 1±n/a nM
Commentsextracted
Citation Lindsay, DJackson, PHindley, SBhamra, I Rosuvastatin and atorvastatin derivatives US Patent US9006282 Publication Date 4/14/2015
 
3-hydroxy-3-methylglutaryl-coenzyme A reductase
Name:3-hydroxy-3-methylglutaryl-coenzyme A reductase
Type:Enzyme
Mol. Mass.:96689.85
Organism:Rattus norvegicus (rat)
Description:Isolated rat liver microsomes were used as enzyme source.
Residue:887
BDBM155380
NameBDBM155380
Synonyms:US9006282, Example 2, Compound 8 | US9102656, Example 2, Compound 8
TypeSmall organic molecule
Emp. Form.C28H29F4N3O5S
Mol. Mass.595.606
SMILESCC(C)c1nc(nc(-c2ccc(F)cc2)c1\C=C\[C@@H]1C[C@@H](O)CC(Oc2c(F)cc(F)cc2F)O1)N(C)S(C)(=O)=O