Reaction Details
Target3-hydroxy-3-methylglutaryl-coenzyme A reductase
LigandBDBM155388
Substrate/Competitorn/a
Meas. Tech.Reductase Assay
pH7.2±n/a
IC50 3±n/a nM
Commentsextracted
Citation Lindsay, DJackson, PHindley, SBhamra, I Rosuvastatin and atorvastatin derivatives US Patent US9006282 Publication Date 4/14/2015
 
3-hydroxy-3-methylglutaryl-coenzyme A reductase
Name:3-hydroxy-3-methylglutaryl-coenzyme A reductase
Type:Enzyme
Mol. Mass.:96689.85
Organism:Rattus norvegicus (rat)
Description:Isolated rat liver microsomes were used as enzyme source.
Residue:887
BDBM155388
NameBDBM155388
Synonyms:US9006282, Example 3, Compound 7
TypeSmall organic molecule
Emp. Form.C44H49FN2O4
Mol. Mass.688.8693
SMILESCC(C)c1c(C(=O)Nc2ccccc2)c(c(-c2ccc(F)cc2)n1CC[C@@H]1C[C@H](CC(OC(C)(C)C)O1)OCc1ccccc1)-c1ccccc1