Reaction Details
TargetFibroblast growth factor receptor 1
LigandBDBM286381
Substrate/Competitorn/a
Meas. Tech.Caliper-Based Kinase Assay
Temperature298.15±n/a K
IC50 0.700±n/a nM
Commentsextracted
Citation Verner, EBrameld, KA Quinolone derivatives as fibroblast growth factor receptor inhibitors US Patent US9567334 Publication Date 2/14/2017
 
Fibroblast growth factor receptor 1
Name:Fibroblast growth factor receptor 1
Type:Receptor
Mol. Mass.:91861.70
Organism:Homo sapiens (Human)
Description:P11362
Residue:822
BDBM286381
NameBDBM286381
Synonyms:8-(2-((1-acryloylpiperidin-3-yl)oxy)ethyl)-6-(2,6-dichloro-3,5-dimethoxyphenyl)-2-(methylamino)pyrido[2,3-d]pyrimidin-7(8H)-one US11078199, Cpd 15 US9815834, Compound 15
TypeSmall organic molecule
Emp. Form.C26H29Cl2N5O5
Mol. Mass.562.445
SMILESCNc1ncc2cc(-c3c(Cl)c(OC)cc(OC)c3Cl)c(=O)n(CCOC3CCCN(C3)C(=O)C=C)c2n1